Reaction Details
Target5-hydroxytryptamine receptor 2C
LigandBDBM50024210
Substrate/Competitorn/a
Ki 62±n/a nM
CommentsPDSP_1920
Citation Herrick-Davis, KGrinde, EGauthier, CTeitler, M Pharmacological characterization of the constitutively activated state of the serotonin 5-HT2C receptor. Ann N Y Acad Sci861:140-5 (1998) 
 
5-hydroxytryptamine receptor 2C
Name:5-hydroxytryptamine receptor 2C
Type:Enzyme
Mol. Mass.:51935.10
Organism:Rattus norvegicus (Rat)
Description:P08909
Residue:460
BDBM50024210
NameBDBM50024210
Synonyms:1H-indole-3-ethanamine 2-(3-indolyl)ethylamine tryptamine
TypeSmall organic molecule
Emp. Form.C10H12N2
Mol. Mass.160.2157
SMILESNCCc1c[nH]c2ccccc12