Reaction Details
TargetEndothelin receptor type B
LigandBDBM50143784
Substrate/Competitorn/a
Ki 0.1±n/a nM
CommentsPDSP_999
Citation Nishikibe, MOhta, HOkada, MIshikawa, KHayama, TFukuroda, TNoguchi, KSaito, MKanoh, TOzaki, SKamei, THara, KWilliam, DKivlighn, SKrause, SGabel, RZingaro, GNolan, NO'Brien, JClayton, FLynch, JPettibone, DSiegl, P Pharmacological properties of J-104132 (L-753,037), a potent, orally active, mixed ETA/ETB endothelin receptor antagonist. J Pharmacol Exp Ther289:1262-70 (1999) Endothelin receptor type B
Name:Endothelin receptor type B
Type:Enzyme Catalytic Domain
Mol. Mass.:49664.00
Organism:Homo sapiens (Human)
Description:ENDOTHELIN B EDNRB HUMAN::P24530
Residue:442
BDBM50143784
NameBDBM50143784
Synonyms:(5S,6R,7R)-5-Benzo[1,3]dioxol-5-yl-2-butyl-7-[2-((S)-2-carboxy-propyl)-4-methoxy-phenyl]-6,7-dihydro-5H-[1]pyrindine-6-carboxylic acid J-104132
TypeSmall organic molecule
Emp. Form.C31H33NO7
Mol. Mass.531.5962
SMILESCCCCc1ccc2[C@@H]([C@H]([C@@H](c2n1)c1ccc(OC)cc1C[C@H](C)C(O)=O)C(O)=O)c1ccc2OCOc2c1