Reaction Details
TargetEnoyl-[acyl-carrier-protein] reductase [NADPH] FabI
LigandBDBM16294
Substrate/Competitorn/a
Meas. Tech.Jump dilution assay
pH7.5±n/a
Temperature298.15±n/a K
Ki 0.090±0.01 nM
Commentsextracted
Citation Tonge, PPan, P Pyridone FabI inhibitors and uses thereof US Patent US10071965 Publication Date 9/11/2018
 
Enoyl-[acyl-carrier-protein] reductase [NADPH] FabI
Name:Enoyl-[acyl-carrier-protein] reductase [NADPH] FabI
Type:Enzyme
Mol. Mass.:27989.00
Organism:Staphylococcus aureus
Description:Q6GI75
Residue:256
BDBM16294
NameBDBM16294
Synonyms:2PP 5-butyl-2-phenoxylphenol AIDS227443 US10071965, Compound PT04
TypeSmall organic molecule
Emp. Form.C14H14O2
Mol. Mass.214.2598
SMILESCCc1ccc(Oc2ccccc2)c(O)c1