Reaction Details
TargetSomatostatin receptor type 4
LigandBDBM275908
Substrate/Competitorn/a
Meas. Tech.Radioligand Binding Assays
Temperature298.15±n/a K
Ki 194±n/a nM
Commentsextracted
Citation Mazzaferro, RFerrara, MGiovannini, RLingard, IRudolf, K Morpholine and 1,4-oxazepane amides as somatostatin receptor subtype 4 (SSTR4) agonists US Patent US10071974 Publication Date 9/11/2018
 
Somatostatin receptor type 4
Name:Somatostatin receptor type 4
Type:Enzyme
Mol. Mass.:42015.38
Organism:Homo sapiens (Human)
Description:P31391
Residue:388
BDBM275908
NameBDBM275908
Synonyms:US10071974, Example 19 | US10577336, Example 19
TypeSmall organic molecule
Emp. Form.C16H22N4O2
Mol. Mass.302.3715
SMILESCn1nc(c2ccccc12)C(C)(C)NC(=O)[C@@H]1CNCCO1