Reaction Details
Target5-hydroxytryptamine receptor 2A
LigandBDBM50024210
Substrate/Competitorn/a
Ki 257.04±n/a nM
CommentsPDSP_1920
Citation Porter, RHBenwell, KRLamb, HMalcolm, CSAllen, NHRevell, DFAdams, DRSheardown, MJ Functional characterization of agonists at recombinant human 5-HT2A, 5-HT2B and 5-HT2C receptors in CHO-K1 cells. Br J Pharmacol128:13-20 (1999) 
 
5-hydroxytryptamine receptor 2A
Name:5-hydroxytryptamine receptor 2A
Type:undefined
Mol. Mass.:52607.65
Organism:Homo sapiens (Human)
Description:P28223
Residue:471
BDBM50024210
NameBDBM50024210
Synonyms:1H-indole-3-ethanamine 2-(3-indolyl)ethylamine tryptamine
TypeSmall organic molecule
Emp. Form.C10H12N2
Mol. Mass.160.2157
SMILESNCCc1c[nH]c2ccccc12