Reaction Details
TargetAngiotensin-converting enzyme 2
LigandBDBM82258
Substrate/Competitorn/a
Ki>10000±n/a nM
CommentsPDSP_1089
Citation Handa, RKHarding, JWSimasko, SM Characterization and function of the bovine kidney epithelial angiotensin receptor subtype 4 using angiotensin IV and divalinal angiotensin IV as receptor ligands. J Pharmacol Exp Ther291:1242-9 (1999) Angiotensin-converting enzyme 2
Name:Angiotensin-converting enzyme 2
Type:Enzyme Catalytic Domain
Mol. Mass.:93046.63
Organism:BOVINE
Description:Angiotensin IV 0 BOVINE::Q58DD0
Residue:804
BDBM82258
NameBDBM82258
Synonyms:CAS_114798-26-4 NSC_3961
TypeSmall organic molecule
Emp. Form.C22H23ClN6O
Mol. Mass.422.911
SMILESCCCCc1nc(Cl)c(CO)n1Cc1ccc(cc1)-c1ccccc1-c1nnn[nH]1