Reaction Details
Target5-hydroxytryptamine receptor 2A
LigandBDBM50005257
Substrate/Competitorn/a
Ki 3.3±n/a nM
CommentsPDSP_706
Citation Egan, CGrinde, EDupre, ARoth, BLHake, MTeitler, MHerrick-Davis, K Agonist high and low affinity state ratios predict drug intrinsic activity and a revised ternary complex mechanism at serotonin 5-HT(2A) and 5-HT(2C) receptors. Synapse35:144-50 (2000) 
 
5-hydroxytryptamine receptor 2A
Name:5-hydroxytryptamine receptor 2A
Type:undefined
Mol. Mass.:52607.65
Organism:Homo sapiens (Human)
Description:P28223
Residue:471
BDBM50005257
NameBDBM50005257
Synonyms:(+)-2-(4-Bromo-2,5-dimethoxy-phenyl)-1-methyl-ethylamine (+/-)2-(4-Bromo-2,5-dimethoxy-phenyl)-1-methyl-ethylamine (-)2-(4-Bromo-2,5-dimethoxy-phenyl)-1-methyl-ethylamine 2-(2-Methoxy-phenyl)-1-methyl-ethylamine 2-(4-Bromo-2,5-dimethoxy-phenyl)-1-methyl-ethylamine((-)-DOB) 2-(4-Bromo-2,5-dimethoxy-phenyl)-1-methyl-ethylamine((S)-(+)-DOB) 2-(4-Bromo-2,5-dimethoxy-phenyl)-1-methyl-ethylamine[R(-)DOB] Brolamfetamine DOB | Racemic DOB
TypeSmall organic molecule
Emp. Form.C11H16BrNO2
Mol. Mass.274.154
SMILESCOc1cc(CC(C)N)c(OC)cc1Br