Reaction Details
Target5-hydroxytryptamine receptor 2C
LigandBDBM50005257
Substrate/Competitorn/a
Ki 10±n/a nM
CommentsPDSP_706
Citation Egan, CGrinde, EDupre, ARoth, BLHake, MTeitler, MHerrick-Davis, K Agonist high and low affinity state ratios predict drug intrinsic activity and a revised ternary complex mechanism at serotonin 5-HT(2A) and 5-HT(2C) receptors. Synapse35:144-50 (2000) 
 
5-hydroxytryptamine receptor 2C
Name:5-hydroxytryptamine receptor 2C
Type:Enzyme
Mol. Mass.:51935.10
Organism:Rattus norvegicus (Rat)
Description:P08909
Residue:460
BDBM50005257
NameBDBM50005257
Synonyms:(+)-2-(4-Bromo-2,5-dimethoxy-phenyl)-1-methyl-ethylamine (+/-)2-(4-Bromo-2,5-dimethoxy-phenyl)-1-methyl-ethylamine (-)2-(4-Bromo-2,5-dimethoxy-phenyl)-1-methyl-ethylamine 2-(2-Methoxy-phenyl)-1-methyl-ethylamine 2-(4-Bromo-2,5-dimethoxy-phenyl)-1-methyl-ethylamine((-)-DOB) 2-(4-Bromo-2,5-dimethoxy-phenyl)-1-methyl-ethylamine((S)-(+)-DOB) 2-(4-Bromo-2,5-dimethoxy-phenyl)-1-methyl-ethylamine[R(-)DOB] Brolamfetamine DOB | Racemic DOB
TypeSmall organic molecule
Emp. Form.C11H16BrNO2
Mol. Mass.274.154
SMILESCOc1cc(CC(C)N)c(OC)cc1Br