Reaction Details
Target5-hydroxytryptamine receptor 2C
LigandBDBM50007406
Substrate/Competitorn/a
Ki 22±n/a nM
CommentsPDSP_1808
Citation Egan, CGrinde, EDupre, ARoth, BLHake, MTeitler, MHerrick-Davis, K Agonist high and low affinity state ratios predict drug intrinsic activity and a revised ternary complex mechanism at serotonin 5-HT(2A) and 5-HT(2C) receptors. Synapse35:144-50 (2000) 
 
5-hydroxytryptamine receptor 2C
Name:5-hydroxytryptamine receptor 2C
Type:Enzyme
Mol. Mass.:51935.10
Organism:Rattus norvegicus (Rat)
Description:P08909
Residue:460
BDBM50007406
NameBDBM50007406
Synonyms:1-(3-(trifluoromethyl)phenyl)piperazine 1-(3-Trifluoromethyl-phenyl)-piperazine(TFMPP) TFMPP
TypeSmall organic molecule
Emp. Form.C11H13F3N2
Mol. Mass.230.2295
SMILESFC(F)(F)c1cccc(c1)N1CCNCC1