Reaction Details
TargetHematopoietic prostaglandin D synthase
LigandBDBM85175
Substrate/Competitorn/a
Ki 0.4±n/a nM
CommentsPDSP_453
Citation Abramovitz, MAdam, MBoie, YCarrière, MDenis, DGodbout, CLamontagne, SRochette, CSawyer, NTremblay, NMBelley, MGallant, MDufresne, CGareau, YRuel, RJuteau, HLabelle, MOuimet, NMetters, KM The utilization of recombinant prostanoid receptors to determine the affinities and selectivities of prostaglandins and related analogs. Biochim Biophys Acta1483:285-93 (2000) 
 
Hematopoietic prostaglandin D synthase
Name:Hematopoietic prostaglandin D synthase
Type:Enzyme
Mol. Mass.:23341.07
Organism:Homo sapiens (Human)
Description:The protein was expressed in E. coli strain BL21(DE3) with an N-terminal 6-His tag.
Residue:199
BDBM85175
NameBDBM85175
Synonyms:BW245C NSC_3080928
TypeSmall organic molecule
Emp. Form.C19H32N2O5
Mol. Mass.368.4678
SMILESOC(CCn1c(CCCCCCC(O)=O)c(O)[nH]c1=O)C1CCCCC1