Reaction Details
TargetHematopoietic prostaglandin D synthase
LigandBDBM82213
Substrate/Competitorn/a
Ki 1.7±n/a nM
CommentsPDSP_1458
Citation Abramovitz, MAdam, MBoie, YCarrière, MDenis, DGodbout, CLamontagne, SRochette, CSawyer, NTremblay, NMBelley, MGallant, MDufresne, CGareau, YRuel, RJuteau, HLabelle, MOuimet, NMetters, KM The utilization of recombinant prostanoid receptors to determine the affinities and selectivities of prostaglandins and related analogs. Biochim Biophys Acta1483:285-93 (2000) 
 
Hematopoietic prostaglandin D synthase
Name:Hematopoietic prostaglandin D synthase
Type:Enzyme
Mol. Mass.:23341.07
Organism:Homo sapiens (Human)
Description:The protein was expressed in E. coli strain BL21(DE3) with an N-terminal 6-His tag.
Residue:199
BDBM82213
NameBDBM82213
Synonyms:CAS_41598-07-6 PGD2
TypeSmall organic molecule
Emp. Form.C20H30O4
Mol. Mass.334.4498
SMILESCCCCCC(O)CC=C1C(CC=CCCCC(O)=O)C=CC1=O