Reaction Details
TargetProstaglandin E2 receptor EP2 subtype
LigandBDBM85179
Substrate/Competitorn/a
Ki 1340±n/a nM
CommentsPDSP_518
Citation Abramovitz, MAdam, MBoie, YCarrière, MDenis, DGodbout, CLamontagne, SRochette, CSawyer, NTremblay, NMBelley, MGallant, MDufresne, CGareau, YRuel, RJuteau, HLabelle, MOuimet, NMetters, KM The utilization of recombinant prostanoid receptors to determine the affinities and selectivities of prostaglandins and related analogs. Biochim Biophys Acta1483:285-93 (2000) 
 
Prostaglandin E2 receptor EP2 subtype
Name:Prostaglandin E2 receptor EP2 subtype
Type:Enzyme
Mol. Mass.:39775.71
Organism:Homo sapiens (Human)
Description:P43116
Residue:358
BDBM85179
NameBDBM85179
Synonyms:CAS_94079-80-8 NSC_72023
TypeSmall organic molecule
Emp. Form.C22H30O5
Mol. Mass.374.4706
SMILESCCC#CCC(C)C(O)C#CC1C(O)CC2CC(CC12)=CCOCC(O)=O