Reaction Details
TargetProstaglandin E2 receptor EP2 subtype
LigandBDBM85605
Substrate/Competitorn/a
Ki>10000±n/a nM
CommentsPDSP_4311
Citation Abramovitz, MAdam, MBoie, YCarrière, MDenis, DGodbout, CLamontagne, SRochette, CSawyer, NTremblay, NMBelley, MGallant, MDufresne, CGareau, YRuel, RJuteau, HLabelle, MOuimet, NMetters, KM The utilization of recombinant prostanoid receptors to determine the affinities and selectivities of prostaglandins and related analogs. Biochim Biophys Acta1483:285-93 (2000) 
 
Prostaglandin E2 receptor EP2 subtype
Name:Prostaglandin E2 receptor EP2 subtype
Type:Enzyme
Mol. Mass.:39775.71
Organism:Homo sapiens (Human)
Description:P43116
Residue:358
BDBM85605
NameBDBM85605
Synonyms:GR 63799
TypeSmall organic molecule
Emp. Form.C34H37NO8
Mol. Mass.587.6595
SMILESOC(COC1C(O)CC(=O)C1CC=CCCCC(=O)Oc1ccc(NC(=O)c2ccccc2)cc1)COc1ccccc1