Reaction Details
TargetProstaglandin E2 receptor EP2 subtype
LigandBDBM85599
Substrate/Competitorn/a
Ki>10000±n/a nM
CommentsPDSP_4309
Citation Abramovitz, MAdam, MBoie, YCarrière, MDenis, DGodbout, CLamontagne, SRochette, CSawyer, NTremblay, NMBelley, MGallant, MDufresne, CGareau, YRuel, RJuteau, HLabelle, MOuimet, NMetters, KM The utilization of recombinant prostanoid receptors to determine the affinities and selectivities of prostaglandins and related analogs. Biochim Biophys Acta1483:285-93 (2000) 
 
Prostaglandin E2 receptor EP2 subtype
Name:Prostaglandin E2 receptor EP2 subtype
Type:Enzyme
Mol. Mass.:39775.71
Organism:Homo sapiens (Human)
Description:P43116
Residue:358
BDBM85599
NameBDBM85599
Synonyms:CAS_146032-79-3 | SC-51322
TypeSmall organic molecule
Emp. Form.C22H20ClN3O4S
Mol. Mass.457.93
SMILESClc1ccc2Oc3ccccc3CN(C(=O)NNC(=O)CCSCc3ccco3)c2c1