Reaction Details
TargetProstaglandin E2 receptor EP3 subtype
LigandBDBM85184
Substrate/Competitorn/a
Ki 1597±n/a nM
CommentsPDSP_257
Citation Abramovitz, MAdam, MBoie, YCarrière, MDenis, DGodbout, CLamontagne, SRochette, CSawyer, NTremblay, NMBelley, MGallant, MDufresne, CGareau, YRuel, RJuteau, HLabelle, MOuimet, NMetters, KM The utilization of recombinant prostanoid receptors to determine the affinities and selectivities of prostaglandins and related analogs. Biochim Biophys Acta1483:285-93 (2000) 
 
Prostaglandin E2 receptor EP3 subtype
Name:Prostaglandin E2 receptor EP3 subtype
Type:Enzyme
Mol. Mass.:43335.03
Organism:Homo sapiens (Human)
Description:P43115
Residue:390
BDBM85184
NameBDBM85184
Synonyms:AH-6809 NSC_119461
TypeSmall organic molecule
Emp. Form.C17H14O5
Mol. Mass.298.2901
SMILESCC(C)Oc1ccc2c(c1)oc1ccc(cc1c2=O)C(O)=O