Reaction Details
TargetProstaglandin E2 receptor EP3 subtype
LigandBDBM85177
Substrate/Competitorn/a
Ki 0.14±n/a nM
CommentsPDSP_1159
Citation Abramovitz, MAdam, MBoie, YCarrière, MDenis, DGodbout, CLamontagne, SRochette, CSawyer, NTremblay, NMBelley, MGallant, MDufresne, CGareau, YRuel, RJuteau, HLabelle, MOuimet, NMetters, KM The utilization of recombinant prostanoid receptors to determine the affinities and selectivities of prostaglandins and related analogs. Biochim Biophys Acta1483:285-93 (2000) 
 
Prostaglandin E2 receptor EP3 subtype
Name:Prostaglandin E2 receptor EP3 subtype
Type:Enzyme
Mol. Mass.:43335.03
Organism:Homo sapiens (Human)
Description:P43115
Residue:390
BDBM85177
NameBDBM85177
Synonyms:CAS_80558-61-8 NSC_119139
TypeSmall organic molecule
Emp. Form.C22H30O5
Mol. Mass.374.4706
SMILESOC(COc1ccccc1)C=CC1CCC(=O)C1CCCCCCC(O)=O