Reaction Details
TargetProstaglandin E2 receptor EP4 subtype
LigandBDBM85338
Substrate/Competitorn/a
Ki>10000±n/a nM
CommentsPDSP_782
Citation Abramovitz, MAdam, MBoie, YCarrière, MDenis, DGodbout, CLamontagne, SRochette, CSawyer, NTremblay, NMBelley, MGallant, MDufresne, CGareau, YRuel, RJuteau, HLabelle, MOuimet, NMetters, KM The utilization of recombinant prostanoid receptors to determine the affinities and selectivities of prostaglandins and related analogs. Biochim Biophys Acta1483:285-93 (2000) 
 
Prostaglandin E2 receptor EP4 subtype
Name:Prostaglandin E2 receptor EP4 subtype
Type:Enzyme
Mol. Mass.:53134.53
Organism:Homo sapiens (Human)
Description:P35408
Residue:488
BDBM85338
NameBDBM85338
Synonyms:CAS_73121-56-9 NSC_5282207
TypeSmall organic molecule
Emp. Form.C23H28O6
Mol. Mass.400.4648
SMILESCOC(=O)CCC=C=CCC1C(C=CC(O)COc2ccccc2)C(O)CC1=O