Reaction Details
TargetProstaglandin E2 receptor EP4 subtype
LigandBDBM85603
Substrate/Competitorn/a
Ki 41±n/a nM
CommentsPDSP_4312
Citation Abramovitz, MAdam, MBoie, YCarrière, MDenis, DGodbout, CLamontagne, SRochette, CSawyer, NTremblay, NMBelley, MGallant, MDufresne, CGareau, YRuel, RJuteau, HLabelle, MOuimet, NMetters, KM The utilization of recombinant prostanoid receptors to determine the affinities and selectivities of prostaglandins and related analogs. Biochim Biophys Acta1483:285-93 (2000) 
 
Prostaglandin E2 receptor EP4 subtype
Name:Prostaglandin E2 receptor EP4 subtype
Type:Enzyme
Mol. Mass.:53134.53
Organism:Homo sapiens (Human)
Description:P35408
Residue:488
BDBM85603
NameBDBM85603
Synonyms:CAS_5311503 ZK110841
TypeSmall organic molecule
Emp. Form.C21H33ClO4
Mol. Mass.384.937
SMILESOC(C=CC1C(O)CC(Cl)C1CC=CCCCC(O)=O)C1CCCCC1