Reaction Details
TargetProstaglandin F2-alpha receptor
LigandBDBM85606
Substrate/Competitorn/a
Ki 9382±n/a nM
CommentsPDSP_4307
Citation Abramovitz, MAdam, MBoie, YCarrière, MDenis, DGodbout, CLamontagne, SRochette, CSawyer, NTremblay, NMBelley, MGallant, MDufresne, CGareau, YRuel, RJuteau, HLabelle, MOuimet, NMetters, KM The utilization of recombinant prostanoid receptors to determine the affinities and selectivities of prostaglandins and related analogs. Biochim Biophys Acta1483:285-93 (2000) 
 
Prostaglandin F2-alpha receptor
Name:Prostaglandin F2-alpha receptor
Type:Enzyme
Mol. Mass.:40072.29
Organism:Homo sapiens (Human)
Description:P43088
Residue:359
BDBM85606
NameBDBM85606
Synonyms:CAS_59122-46-2 | MISOPROSTOL (Free Acid)
TypeSmall organic molecule
Emp. Form.C22H38O5
Mol. Mass.382.5341
SMILESCCCCC(C)(O)C\C=C\[C@H]1[C@H](O)CC(=O)[C@@H]1CCCCCCC(=O)OC