Reaction Details
TargetProstaglandin F2-alpha receptor
LigandBDBM85603
Substrate/Competitorn/a
Ki 1670±n/a nM
CommentsPDSP_4312
Citation Abramovitz, MAdam, MBoie, YCarrière, MDenis, DGodbout, CLamontagne, SRochette, CSawyer, NTremblay, NMBelley, MGallant, MDufresne, CGareau, YRuel, RJuteau, HLabelle, MOuimet, NMetters, KM The utilization of recombinant prostanoid receptors to determine the affinities and selectivities of prostaglandins and related analogs. Biochim Biophys Acta1483:285-93 (2000) 
 
Prostaglandin F2-alpha receptor
Name:Prostaglandin F2-alpha receptor
Type:Enzyme
Mol. Mass.:40072.29
Organism:Homo sapiens (Human)
Description:P43088
Residue:359
BDBM85603
NameBDBM85603
Synonyms:CAS_5311503 ZK110841
TypeSmall organic molecule
Emp. Form.C21H33ClO4
Mol. Mass.384.937
SMILESOC(C=CC1C(O)CC(Cl)C1CC=CCCCC(O)=O)C1CCCCC1