Reaction Details
TargetSolute carrier organic anion transporter family member 2A1
LigandBDBM85184
Substrate/Competitorn/a
Ki 4325±n/a nM
CommentsPDSP_257
Citation Abramovitz, MAdam, MBoie, YCarrière, MDenis, DGodbout, CLamontagne, SRochette, CSawyer, NTremblay, NMBelley, MGallant, MDufresne, CGareau, YRuel, RJuteau, HLabelle, MOuimet, NMetters, KM The utilization of recombinant prostanoid receptors to determine the affinities and selectivities of prostaglandins and related analogs. Biochim Biophys Acta1483:285-93 (2000) 
 
Solute carrier organic anion transporter family member 2A1
Name:Solute carrier organic anion transporter family member 2A1
Type:Enzyme Catalytic Domain
Mol. Mass.:70068.67
Organism:Homo sapiens (Human)
Description:Prostaglandin Transporter 0 HUMAN::Q92959
Residue:643
BDBM85184
NameBDBM85184
Synonyms:AH-6809 NSC_119461
TypeSmall organic molecule
Emp. Form.C17H14O5
Mol. Mass.298.2901
SMILESCC(C)Oc1ccc2c(c1)oc1ccc(cc1c2=O)C(O)=O