Reaction Details
TargetSolute carrier organic anion transporter family member 2A1
LigandBDBM85175
Substrate/Competitorn/a
Ki>10000±n/a nM
CommentsPDSP_453
Citation Abramovitz, MAdam, MBoie, YCarrière, MDenis, DGodbout, CLamontagne, SRochette, CSawyer, NTremblay, NMBelley, MGallant, MDufresne, CGareau, YRuel, RJuteau, HLabelle, MOuimet, NMetters, KM The utilization of recombinant prostanoid receptors to determine the affinities and selectivities of prostaglandins and related analogs. Biochim Biophys Acta1483:285-93 (2000) 
 
Solute carrier organic anion transporter family member 2A1
Name:Solute carrier organic anion transporter family member 2A1
Type:Enzyme Catalytic Domain
Mol. Mass.:70068.67
Organism:Homo sapiens (Human)
Description:Prostaglandin Transporter 0 HUMAN::Q92959
Residue:643
BDBM85175
NameBDBM85175
Synonyms:BW245C NSC_3080928
TypeSmall organic molecule
Emp. Form.C19H32N2O5
Mol. Mass.368.4678
SMILESOC(CCn1c(CCCCCCC(O)=O)c(O)[nH]c1=O)C1CCCCC1