Reaction Details
TargetSolute carrier organic anion transporter family member 2A1
LigandBDBM85338
Substrate/Competitorn/a
Ki>10000±n/a nM
CommentsPDSP_782
Citation Abramovitz, MAdam, MBoie, YCarrière, MDenis, DGodbout, CLamontagne, SRochette, CSawyer, NTremblay, NMBelley, MGallant, MDufresne, CGareau, YRuel, RJuteau, HLabelle, MOuimet, NMetters, KM The utilization of recombinant prostanoid receptors to determine the affinities and selectivities of prostaglandins and related analogs. Biochim Biophys Acta1483:285-93 (2000) 
 
Solute carrier organic anion transporter family member 2A1
Name:Solute carrier organic anion transporter family member 2A1
Type:Enzyme Catalytic Domain
Mol. Mass.:70068.67
Organism:Homo sapiens (Human)
Description:Prostaglandin Transporter 0 HUMAN::Q92959
Residue:643
BDBM85338
NameBDBM85338
Synonyms:CAS_73121-56-9 NSC_5282207
TypeSmall organic molecule
Emp. Form.C23H28O6
Mol. Mass.400.4648
SMILESCOC(=O)CCC=C=CCC1C(C=CC(O)COc2ccccc2)C(O)CC1=O