Reaction Details
TargetSolute carrier organic anion transporter family member 2A1
LigandBDBM85178
Substrate/Competitorn/a
Ki>10000±n/a nM
CommentsPDSP_4308
Citation Abramovitz, MAdam, MBoie, YCarrière, MDenis, DGodbout, CLamontagne, SRochette, CSawyer, NTremblay, NMBelley, MGallant, MDufresne, CGareau, YRuel, RJuteau, HLabelle, MOuimet, NMetters, KM The utilization of recombinant prostanoid receptors to determine the affinities and selectivities of prostaglandins and related analogs. Biochim Biophys Acta1483:285-93 (2000) 
 
Solute carrier organic anion transporter family member 2A1
Name:Solute carrier organic anion transporter family member 2A1
Type:Enzyme Catalytic Domain
Mol. Mass.:70068.67
Organism:Homo sapiens (Human)
Description:Prostaglandin Transporter 0 HUMAN::Q92959
Residue:643
BDBM85178
NameBDBM85178
Synonyms:CAS_59122-46-2 MISOPROSTOL (Methyl Ester) | NSC_5282381
TypeSmall organic molecule
Emp. Form.C22H38O5
Mol. Mass.382.5341
SMILESCCCCC(C)(O)CC=CC1C(O)CC(=O)C1CCCCCCC(=O)OC