Reaction Details
TargetIsoform 2 of Histone lysine demethylase PHF8 (2)
LigandBDBM276051
Substrate/Competitorn/a
Meas. Tech.PHF8 Assay
Temperature298.15±n/a K
IC50 5500±n/a nM
Commentsextracted
Citation Chen, YKNie, ZStafford, JAVeal, JM Histone demethylase inhibitors US Patent US10071984 Publication Date 9/11/2018
 
Isoform 2 of Histone lysine demethylase PHF8 (2)
Name:Isoform 2 of Histone lysine demethylase PHF8 (2)
Type:Enzyme Catalytic Domain
Mol. Mass.:113932.27
Organism:Homo sapiens (Human)
Description:Q9UPP1-2
Residue:1024
BDBM276051
NameBDBM276051
Synonyms:4-[2-[1-[(2-chlorophenyl)methyl]imidazol-4-yl]pyridin-4-yl]-1H-triazole-5-carbonitrile US9896436, Example 13
TypeSmall organic molecule
Emp. Form.C18H12ClN7
Mol. Mass.361.788
SMILESClc1ccccc1Cn1cnc(c1)-c1cc(ccn1)-c1nn[nH]c1C#N