Reaction Details
TargetLysine-specific demethylase 2B
LigandBDBM276058
Substrate/Competitorn/a
Meas. Tech.FBXL10 Assay
Temperature298.15±n/a K
IC50<100±n/a nM
Commentsextracted
Citation Chen, YKNie, ZStafford, JAVeal, JM Histone demethylase inhibitors US Patent US10071984 Publication Date 9/11/2018
 
Lysine-specific demethylase 2B
Name:Lysine-specific demethylase 2B
Type:Enzyme Catalytic Domain
Mol. Mass.:152658.35
Organism:Homo sapiens (Human)
Description:Q8NHM5
Residue:1336
BDBM276058
NameBDBM276058
Synonyms:2-[1-[(2,3-dichlorophenyl)methyl]imidazol-4-yl]-4-(5-fluoro-1H-triazol-4-yl)pyridine US10174003, Example 20 | US9896436, Example 20
TypeSmall organic molecule
Emp. Form.C17H11Cl2FN6
Mol. Mass.389.214
SMILESFc1[nH]nnc1-c1ccnc(c1)-c1cn(Cc2cccc(Cl)c2Cl)cn1