Reaction Details
TargetLysine-specific demethylase 2A
LigandBDBM276060
Substrate/Competitorn/a
Meas. Tech.FBXL11 Assay
Temperature298.15±n/a K
IC50<100±n/a nM
Commentsextracted
Citation Chen, YKNie, ZStafford, JAVeal, JM Histone demethylase inhibitors US Patent US10071984 Publication Date 9/11/2018
 
Lysine-specific demethylase 2A
Name:Lysine-specific demethylase 2A
Type:Enzyme Catalytic Domain
Mol. Mass.:132809.04
Organism:Homo sapiens (Human)
Description:n/a
Residue:1162
BDBM276060
NameBDBM276060
Synonyms:2-[1-[[2-chloro-3-(trifluoromethyl)phenyl]methyl]imidazol-4-yl]-4-(1H-triazol-4-yl)pyridine US9896436, Example 22
TypeSmall organic molecule
Emp. Form.C18H12ClF3N6
Mol. Mass.404.776
SMILESFC(F)(F)c1cccc(Cn2cnc(c2)-c2cc(ccn2)-c2c[nH]nn2)c1Cl