Reaction Details
TargetLysine-specific demethylase 2B
LigandBDBM276062
Substrate/Competitorn/a
Meas. Tech.FBXL10 Assay
Temperature298.15±n/a K
IC50<100±n/a nM
Commentsextracted
Citation Chen, YKNie, ZStafford, JAVeal, JM Histone demethylase inhibitors US Patent US10071984 Publication Date 9/11/2018
 
Lysine-specific demethylase 2B
Name:Lysine-specific demethylase 2B
Type:Enzyme Catalytic Domain
Mol. Mass.:152658.35
Organism:Homo sapiens (Human)
Description:Q8NHM5
Residue:1336
BDBM276062
NameBDBM276062
Synonyms:2-[5-(4-fluoro-3-methoxyphenyl)-1-methylimidazol-4-yl]-4-(1H-triazol-4-yl)pyridine US10174003, Example 24 | US9896436, Example 24
TypeSmall organic molecule
Emp. Form.C18H15FN6O
Mol. Mass.350.3497
SMILESCOc1cc(ccc1F)-c1c(ncn1C)-c1cc(ccn1)-c1c[nH]nn1