Reaction Details
TargetIsoform 2 of Histone lysine demethylase PHF8 (2)
LigandBDBM276067
Substrate/Competitorn/a
Meas. Tech.PHF8 Assay
Temperature298.15±n/a K
IC50<100±n/a nM
Commentsextracted
Citation Chen, YKNie, ZStafford, JAVeal, JM Histone demethylase inhibitors US Patent US10071984 Publication Date 9/11/2018
 
Isoform 2 of Histone lysine demethylase PHF8 (2)
Name:Isoform 2 of Histone lysine demethylase PHF8 (2)
Type:Enzyme Catalytic Domain
Mol. Mass.:113932.27
Organism:Homo sapiens (Human)
Description:Q9UPP1-2
Residue:1024
BDBM276067
NameBDBM276067
Synonyms:2-[1-[(3-chloro-2-fluorophenyl)methyl]imidazol-4-yl]-4-(1H-triazol-4-yl)pyridine US10174003, Example 29 | US9896436, Example 29
TypeSmall organic molecule
Emp. Form.C17H12ClFN6
Mol. Mass.354.769
SMILESFc1c(Cl)cccc1Cn1cnc(c1)-c1cc(ccn1)-c1c[nH]nn1