Reaction Details
TargetIsoform 2 of Histone lysine demethylase PHF8 (2)
LigandBDBM276070
Substrate/Competitorn/a
Meas. Tech.PHF8 Assay
Temperature298.15±n/a K
IC50 550±n/a nM
Commentsextracted
Citation Chen, YKNie, ZStafford, JAVeal, JM Histone demethylase inhibitors US Patent US10071984 Publication Date 9/11/2018
 
Isoform 2 of Histone lysine demethylase PHF8 (2)
Name:Isoform 2 of Histone lysine demethylase PHF8 (2)
Type:Enzyme Catalytic Domain
Mol. Mass.:113932.27
Organism:Homo sapiens (Human)
Description:Q9UPP1-2
Residue:1024
BDBM276070
NameBDBM276070
Synonyms:2-[1-[2-(2-chlorophenyl)-2-methylpropyl]imidazol-4-yl]-4-(1H-triazol-4-yl)pyridine US10174003, Example 32 | US9896436, Example 32
TypeSmall organic molecule
Emp. Form.C20H19ClN6
Mol. Mass.378.858
SMILESCC(C)(Cn1cnc(c1)-c1cc(ccn1)-c1c[nH]nn1)c1ccccc1Cl