Reaction Details
TargetLysine-specific demethylase 2B
LigandBDBM276092
Substrate/Competitorn/a
Meas. Tech.FBXL10 Assay
Temperature298.15±n/a K
IC50 550±n/a nM
Commentsextracted
Citation Chen, YKNie, ZStafford, JAVeal, JM Histone demethylase inhibitors US Patent US10071984 Publication Date 9/11/2018
 
Lysine-specific demethylase 2B
Name:Lysine-specific demethylase 2B
Type:Enzyme Catalytic Domain
Mol. Mass.:152658.35
Organism:Homo sapiens (Human)
Description:Q8NHM5
Residue:1336
BDBM276092
NameBDBM276092
Synonyms:5-[2-(cyclopropylmethoxy)-4-fluorophenyl]-1-methyl-4-{1H-[1,2,3]triazolo[4,5-c]pyridin-6-yl}-1H-imidazole US10174003, Example 54 | US9896436, Example 54
TypeSmall organic molecule
Emp. Form.C19H17FN6O
Mol. Mass.364.3763
SMILESCn1cnc(c1-c1ccc(F)cc1OCC1CC1)-c1cc2[nH]nnc2cn1