Reaction Details
TargetIsoform 2 of Histone lysine demethylase PHF8 (2)
LigandBDBM276093
Substrate/Competitorn/a
Meas. Tech.PHF8 Assay
Temperature298.15±n/a K
IC50 550±n/a nM
Commentsextracted
Citation Chen, YKNie, ZStafford, JAVeal, JM Histone demethylase inhibitors US Patent US10071984 Publication Date 9/11/2018
 
Isoform 2 of Histone lysine demethylase PHF8 (2)
Name:Isoform 2 of Histone lysine demethylase PHF8 (2)
Type:Enzyme Catalytic Domain
Mol. Mass.:113932.27
Organism:Homo sapiens (Human)
Description:Q9UPP1-2
Residue:1024
BDBM276093
NameBDBM276093
Synonyms:2-(5-bromo-1-(2-chlorobenzyl)-1H-imidazol-4-yl)-4-(2H-1,2,3-triazol-4-yl)pyridine US10174003, Example 55A: | US9896436, Example 55
TypeSmall organic molecule
Emp. Form.C17H12BrClN6
Mol. Mass.415.674
SMILESClc1ccccc1Cn1cnc(c1Br)-c1cc(ccn1)-c1cn[nH]n1