Reaction Details
TargetHistamine H3 receptor
LigandBDBM22911
Substrate/Competitorn/a
Ki 0.6±n/a nM
CommentsPDSP_968
Citation Lovenberg, TWPyati, JChang, HWilson, SJErlander, MG Cloning of rat histamine H(3) receptor reveals distinct species pharmacological profiles. J Pharmacol Exp Ther293:771-8 (2000) Histamine H3 receptor
Name:Histamine H3 receptor
Type:G Protein-Coupled Receptor (GPCR)
Mol. Mass.:48691.47
Organism:Homo sapiens (Human)
Description:Binding assays were using CHO cells stably expressing hH3R receptors.
Residue:445
BDBM22911
NameBDBM22911
Synonyms:2-(3H-imidazol-4-yl)ethylsulfanylmethanimidamide CHEMBL544911 {[2-(1H-imidazol-4-yl)ethyl]sulfanyl}methanimidamide
TypeSmall organic molecule
Emp. Form.C6H10N4S
Mol. Mass.170.235
SMILESNC(=N)SCCc1cnc[nH]1