Reaction Details
TargetHrh3 protein
LigandBDBM22530
Substrate/Competitorn/a
Ki 1.2±n/a nM
CommentsPDSP_1343
Citation Lovenberg, TWPyati, JChang, HWilson, SJErlander, MG Cloning of rat histamine H(3) receptor reveals distinct species pharmacological profiles. J Pharmacol Exp Ther293:771-8 (2000) Hrh3 protein
Name:Hrh3 protein
Type:Enzyme Catalytic Domain
Mol. Mass.:37860.96
Organism:RAT
Description:Q5PPG3
Residue:344
BDBM22530
NameBDBM22530
Synonyms:N(alpha)-Methylhistamine N-methylhistamine [2-(1H-imidazol-5-yl)ethyl](methyl)amine | [3H]N-alpha-methyl histamine
Typeradiolabeled ligand
Emp. Form.C6H11N3
Mol. Mass.125.1716
SMILESCNCCc1cnc[nH]1