Reaction Details
TargetRetinoic acid receptor RXR-alpha
LigandBDBM276109
Substrate/Competitorn/a
Meas. Tech.NR2B standard assay
pH7.4±n/a
Temperature298.15±n/a K
IC50 1.000±n/a nM
Commentsextracted
Citation Chen, GChrovian, CCCoate, HRDvorak, CAGelin, CFHiscox, ALetavic, MARech, JCSoyode-Johnson, AStenne, BWall, JLZhang, W Substituted 1,2,3-triazoles as NR2B-selective NMDA modulators US Patent US10071988 Publication Date 9/11/2018
 
Retinoic acid receptor RXR-alpha
Name:Retinoic acid receptor RXR-alpha
Type:PROTEIN
Mol. Mass.:50820.38
Organism:Homo sapiens (Human)
Description:ChEMBL_1456363
Residue:462
BDBM276109
NameBDBM276109
Synonyms:2-[[1-(3-Bromo-4-fluoro-phenyl)triazol-4-yl]methoxy]-5-methyl- US10233173, Example 16
TypeSmall organic molecule
Emp. Form.C14H11BrFN5O
Mol. Mass.364.172
SMILESCc1cnc(OCc2cn(nn2)-c2ccc(F)c(Br)c2)nc1