Reaction Details
TargetRetinoic acid receptor RXR-alpha
LigandBDBM276125
Substrate/Competitorn/a
Meas. Tech.NR2B standard assay
pH7.4±n/a
Temperature298.15±n/a K
IC50 2.00±n/a nM
Commentsextracted
Citation Chen, GChrovian, CCCoate, HRDvorak, CAGelin, CFHiscox, ALetavic, MARech, JCSoyode-Johnson, AStenne, BWall, JLZhang, W Substituted 1,2,3-triazoles as NR2B-selective NMDA modulators US Patent US10071988 Publication Date 9/11/2018
 
Retinoic acid receptor RXR-alpha
Name:Retinoic acid receptor RXR-alpha
Type:PROTEIN
Mol. Mass.:50820.38
Organism:Homo sapiens (Human)
Description:ChEMBL_1456363
Residue:462
BDBM276125
NameBDBM276125
Synonyms:2-[[1-[4-Chloro-3-(difluoromethyl)phenyl]triazol-4-yl]methoxy]-5- US10233173, Example 32
TypeSmall organic molecule
Emp. Form.C16H14ClF2N5O
Mol. Mass.365.765
SMILESCCc1cnc(OCc2cn(nn2)-c2ccc(Cl)c(c2)C(F)F)nc1