Reaction Details
TargetRetinoic acid receptor RXR-alpha
LigandBDBM276369
Substrate/Competitorn/a
Meas. Tech.NR2B standard assay
pH7.4±n/a
Temperature298.15±n/a K
IC50 3.00±n/a nM
Commentsextracted
Citation Chen, GChrovian, CCCoate, HRDvorak, CAGelin, CFHiscox, ALetavic, MARech, JCSoyode-Johnson, AStenne, BWall, JLZhang, W Substituted 1,2,3-triazoles as NR2B-selective NMDA modulators US Patent US10071988 Publication Date 9/11/2018
 
Retinoic acid receptor RXR-alpha
Name:Retinoic acid receptor RXR-alpha
Type:PROTEIN
Mol. Mass.:50820.38
Organism:Homo sapiens (Human)
Description:ChEMBL_1456363
Residue:462
BDBM276369
NameBDBM276369
Synonyms:2-[[1-[3-(1,1-Difluoroethyl)phenyl]triazol-4-yl]methoxy]-5- US10233173, Example 308
TypeSmall organic molecule
Emp. Form.C16H13F4N5O2
Mol. Mass.383.3003
SMILESCC(F)(F)c1cccc(c1)-n1cc(COc2ncc(OC(F)F)cn2)nn1