Reaction Details
TargetNorepinephrine transporter
LigandBDBM50005536
Substrate/Competitorn/a
Ki 2.88±n/a nM
CommentsPDSP_1164
Citation Rothman, RBBaumann, MHDersch, CMRomero, DVRice, KCCarroll, FIPartilla, JS Amphetamine-type central nervous system stimulants release norepinephrine more potently than they release dopamine and serotonin. Synapse39:32-41 (2001) 
 
Norepinephrine transporter
Name:Norepinephrine transporter
Synonyms:n/a
Type:Enzyme Catalytic Domain
Mol. Mass.:2082.45
Organism:RAT
Description:Norepinephrine transporter 0 RAT::Q9JIA2
Residue:19
MLLARMKPQVQPELGGADQ
BDBM50005536
NameBDBM50005536
TypeSmall organic molecule
Emp. Form.C16H13ClN2O
Mol. Mass.284.74
SMILESOC1(N2CCN=C2c2ccccc12)c1ccc(Cl)cc1