Reaction Details
TargetMetabotropic glutamate receptor 5
LigandBDBM50004863
Substrate/Competitorn/a
Ki 2100±n/a nM
CommentsPDSP_96
Citation Mutel, VEllis, GJAdam, GChaboz, SNilly, AMesser, JBleuel, ZMetzler, VMalherbe, PSchlaeger, EJRoughley, BSFaull, RLRichards, JG Characterization of [(3)H]Quisqualate binding to recombinant rat metabotropic glutamate 1a and 5a receptors and to rat and human brain sections. J Neurochem75:2590-601 (2000) 
 
Metabotropic glutamate receptor 5
Name:Metabotropic glutamate receptor 5
Type:Enzyme
Mol. Mass.:132484.72
Organism:Homo sapiens (Human)
Description:n/a
Residue:1212
BDBM50004863
NameBDBM50004863
Synonyms:(+/-)-trans-ACPD (1S,3S)-1-aminocyclopentane-1,3-dicarboxylic acid 1-Amino-cyclopentane-1,3-dicarboxylic acid(cis-(1S,3S)-ACPD) 1R,3S-ACPD CHEMBL29726
TypeSmall organic molecule
Emp. Form.C7H11NO4
Mol. Mass.173.1665
SMILESN[C@]1(CC[C@@H](C1)C(O)=O)C(O)=O