Reaction Details
TargetGamma-aminobutyric acid receptor subunit rho-3
LigandBDBM23183
Substrate/Competitorn/a
Ki 460±n/a nM
CommentsPDSP_1260
Citation Chang, YCovey, DFWeiss, DS Correlation of the apparent affinities and efficacies of gamma-aminobutyric acid(C) receptor agonists. Mol Pharmacol58:1375-80 (2000) 
 
Gamma-aminobutyric acid receptor subunit rho-3
Name:Gamma-aminobutyric acid receptor subunit rho-3
Type:Enzyme Catalytic Domain
Mol. Mass.:54281.08
Organism:Homo sapiens (Human)
Description:GABA B rho 1 0 HUMAN::A8MPY1
Residue:467
BDBM23183
NameBDBM23183
Synonyms:5-(aminomethyl)-1,2-oxazol-3-ol CHEMBL273481 Pantherine
TypeGABA Agonist
Emp. Form.C4H6N2O2
Mol. Mass.114.1026
SMILESNCc1cc(=O)[nH]o1