Reaction Details
TargetSolute carrier organic anion transporter family member 2A1
LigandBDBM85719
Substrate/Competitorn/a
Ki 5000±n/a nM
CommentsPDSP_1466
Citation Schuster, VLItoh, SAndrews, SWBurk, RMChen, JKedzie, KMGil, DWWoodward, DF Synthetic modification of prostaglandin f(2alpha) indicates different structural determinants for binding to the prostaglandin F receptor versus the prostaglandin transporter. Mol Pharmacol58:1511-6 (2000) 
 
Solute carrier organic anion transporter family member 2A1
Name:Solute carrier organic anion transporter family member 2A1
Type:Enzyme Catalytic Domain
Mol. Mass.:70068.67
Organism:Homo sapiens (Human)
Description:Prostaglandin Transporter 0 HUMAN::Q92959
Residue:643
BDBM85719
NameBDBM85719
Synonyms:PGF2 Alpha, 1-isopropyl ester
TypeSmall organic molecule
Emp. Form.C23H40O5
Mol. Mass.396.5607
SMILESCCCCCC(O)C=CC1C(O)CC(O)C1CC=CCCCC(=O)OC(C)C