Reaction Details
TargetProstaglandin G/H synthase 1
LigandBDBM50110999
Substrate/Competitorn/a
Ki>10000±n/a nM
CommentsPDSP_4453
Citation Riendeau, DPercival, MDBrideau, CCharleson, SDubé, DEthier, DFalgueyret, JPFriesen, RWGordon, RGreig, GGuay, JMancini, JOuellet, MWong, EXu, LBoyce, SVisco, DGirard, YPrasit, PZamboni, RRodger, IWGresser, MFord-Hutchinson, AWYoung, RNChan, CC Etoricoxib (MK-0663): preclinical profile and comparison with other agents that selectively inhibit cyclooxygenase-2. J Pharmacol Exp Ther296:558-66 (2001) Prostaglandin G/H synthase 1
Name:Prostaglandin G/H synthase 1
Type:Enzyme
Mol. Mass.:68692.62
Organism:Homo sapiens (Human)
Description:P23219
Residue:599
BDBM50110999
NameBDBM50110999
Synonyms:4-(4-Cyclohexyl-2-methyl-oxazol-5-yl)-2-fluoro-benzenesulfonamide JTE-522 | Tilmacoxib
TypeSmall organic molecule
Emp. Form.C16H19FN2O3S
Mol. Mass.338.397
SMILESCc1nc(C2CCCCC2)c(o1)-c1ccc(c(F)c1)S(N)(=O)=O