Reaction Details
TargetProstaglandin G/H synthase 1
LigandBDBM50056998
Substrate/Competitorn/a
Ki 1400±n/a nM
CommentsPDSP_3995
Citation Riendeau, DPercival, MDBrideau, CCharleson, SDubé, DEthier, DFalgueyret, JPFriesen, RWGordon, RGreig, GGuay, JMancini, JOuellet, MWong, EXu, LBoyce, SVisco, DGirard, YPrasit, PZamboni, RRodger, IWGresser, MFord-Hutchinson, AWYoung, RNChan, CC Etoricoxib (MK-0663): preclinical profile and comparison with other agents that selectively inhibit cyclooxygenase-2. J Pharmacol Exp Ther296:558-66 (2001) Prostaglandin G/H synthase 1
Name:Prostaglandin G/H synthase 1
Type:Enzyme
Mol. Mass.:68692.62
Organism:Homo sapiens (Human)
Description:P23219
Residue:599
BDBM50056998
NameBDBM50056998
Synonyms:4-Hydroxy-1,1-dioxo-1,2-dihydro-1lambda*6*-benzo[e][1,2]thiazine-3-carboxylic acid (5-methyl-thiazol-2-yl)-amide CHEMBL599 Meloxicam sodium UH-AC 62XX | UHAC-62XX
TypeSmall organic molecule
Emp. Form.C14H13N3O4S2
Mol. Mass.351.401
SMILESCN1C(C(=O)Nc2ncc(C)s2)=C(O)c2ccccc2S1(=O)=O