Reaction Details
TargetProstaglandin G/H synthase 2
LigandBDBM50072064
Substrate/Competitorn/a
Ki 5000±n/a nM
CommentsPDSP_3998
Citation Riendeau, DPercival, MDBrideau, CCharleson, SDubé, DEthier, DFalgueyret, JPFriesen, RWGordon, RGreig, GGuay, JMancini, JOuellet, MWong, EXu, LBoyce, SVisco, DGirard, YPrasit, PZamboni, RRodger, IWGresser, MFord-Hutchinson, AWYoung, RNChan, CC Etoricoxib (MK-0663): preclinical profile and comparison with other agents that selectively inhibit cyclooxygenase-2. J Pharmacol Exp Ther296:558-66 (2001) Prostaglandin G/H synthase 2
Name:Prostaglandin G/H synthase 2
Type:Enzyme
Mol. Mass.:69003.89
Organism:Homo sapiens (Human)
Description:Recombinant Cox-2 provided by Cayman (Cayman Chemical Co.,Ann Arbor, MI).
Residue:604
BDBM50072064
NameBDBM50072064
Synonyms:5-Chloro-3-(4-methanesulfonyl-phenyl)-6''-methyl-[2,3'']bipyridinyl 5-chloro-2-(6-methylpyridin-3-yl)-3-(4-(methylsulfonyl)phenyl)pyridine CHEMBL416146 | ETORICOXIB
TypeSmall organic molecule
Emp. Form.C18H15ClN2O2S
Mol. Mass.358.842
SMILESCc1ccc(cn1)-c1ncc(Cl)cc1-c1ccc(cc1)S(C)(=O)=O