Reaction Details
TargetHistamine H3 receptor
LigandBDBM7966
Substrate/Competitorn/a
Ki 5.4±n/a nM
CommentsPDSP_934
Citation Liu, CMa, XJiang, XWilson, SJHofstra, CLBlevitt, JPyati, JLi, XChai, WCarruthers, NLovenberg, TW Cloning and pharmacological characterization of a fourth histamine receptor (H(4)) expressed in bone marrow. Mol Pharmacol59:420-6 (2001) 
 
Histamine H3 receptor
Name:Histamine H3 receptor
Type:G Protein-Coupled Receptor (GPCR)
Mol. Mass.:48691.47
Organism:Homo sapiens (Human)
Description:Binding assays were using CHO cells stably expressing hH3R receptors.
Residue:445
BDBM7966
NameBDBM7966
Synonyms:2-(1H-imidazol-4-yl)ethan-1-amine CHEMBL90 Ergotidine Histamine Peremin | [3H]histamine
TypeSmall organic molecule
Emp. Form.C5H9N3
Mol. Mass.111.1451
SMILESNCCc1cnc[nH]1