Reaction Details
TargetHistamine H4 receptor
LigandBDBM50017721
Substrate/Competitorn/a
Ki>10000±n/a nM
CommentsPDSP_606
Citation Liu, CMa, XJiang, XWilson, SJHofstra, CLBlevitt, JPyati, JLi, XChai, WCarruthers, NLovenberg, TW Cloning and pharmacological characterization of a fourth histamine receptor (H(4)) expressed in bone marrow. Mol Pharmacol59:420-6 (2001) 
 
Histamine H4 receptor
Name:Histamine H4 receptor
Type:G Protein-Coupled Receptor (GPCR)
Mol. Mass.:44517.02
Organism:Homo sapiens (Human)
Description:Binding assays were using CHO cells stably expressing hH4R receptors.
Residue:390
BDBM50017721
NameBDBM50017721
Synonyms:1-Methyl-4-(5H-dibenzo(a,d)cycloheptenylidene)piperidine 4-(5-dibenzo(a,d)cyclohepten-5-ylidine)-1-methylpiperidine 4-(5H-dibenzo[a,d][7]annulen-5-ylidene)-1-methylpiperidine4-(5H-dibenzo[a,d]cyclohepten-5-ylidene)-1-methylpiperidine CHEMBL516 | CYPROHEPTADINE
TypeSmall organic molecule
Emp. Form.C21H21N
Mol. Mass.287.3981
SMILES[#6]-[#7]-1-[#6]-[#6]\[#6](-[#6]-[#6]-1)=[#6]-1/c2ccccc2-[#6]=[#6]-c2ccccc-12