Reaction Details
TargetTyrosinase
LigandBDBM50218205
Substrate/Competitorn/a
Meas. Tech.Inhibition Assay
pH6.8±0
Temperature310.15±0 K
IC50 2.994e+4± 428.89 nM
Citation Khan, KMSaify, ZSKhan, MTButt, NMaharvi, GMPerveen, SAmbreen, NChoudhary, MIAtta-Ur-Rahman, ASupuran, CT Tyrosinase inhibition: conformational analysis based studies on molecular dynamics calculations of bipiperidine based inhibitors. J Enzyme Inhib Med Chem20:401-7 (2005) 
 
Tyrosinase
Name:Tyrosinase
Type:Protein
Mol. Mass.:60388.08
Organism:Homo sapiens (Human)
Description:P14679
Residue:529
BDBM50218205
NameBDBM50218205
Synonyms:1-(4-(piperidin-1-yl)piperidin-1-yl)ethanone Tyrosinase Inhibitor, 2
TypeSmall organic molecule
Emp. Form.C12H22N2O
Mol. Mass.210.3159
SMILESCC(=O)N1CCC(CC1)N1CCCCC1