Reaction Details
TargetTrace amine-associated receptor 1
LigandBDBM7966
Substrate/Competitorn/a
Ki 3107±n/a nM
CommentsPDSP_934
Citation Borowsky, BAdham, NJones, KARaddatz, RArtymyshyn, ROgozalek, KLDurkin, MMLakhlani, PPBonini, JAPathirana, SBoyle, NPu, XKouranova, ELichtblau, HOchoa, FYBranchek, TAGerald, C Trace amines: identification of a family of mammalian G protein-coupled receptors. Proc Natl Acad Sci U S A98:8966-71 (2001) 
 
Trace amine-associated receptor 1
Name:Trace amine-associated receptor 1
Type:PROTEIN
Mol. Mass.:39107.47
Organism:Homo sapiens (Human)
Description:ChEMBL_792734
Residue:339
BDBM7966
NameBDBM7966
Synonyms:2-(1H-imidazol-4-yl)ethan-1-amine CHEMBL90 Ergotidine Histamine Peremin | [3H]histamine
TypeSmall organic molecule
Emp. Form.C5H9N3
Mol. Mass.111.1451
SMILESNCCc1cnc[nH]1