Reaction Details
TargetBone morphogenetic protein receptor type-1A
LigandBDBM148329
Substrate/Competitorn/a
Meas. Tech.Enzyme Assay
IC50 5280±n/a nM
Citation Alimardanov, ACuny, GDGrewal, GSLee, AMcKew, JCMohedas, AHShen, MXu, XYu, PB BMP inhibitors and methods of use thereof US Patent US10017516 Publication Date 7/10/2018
 
Bone morphogenetic protein receptor type-1A
Name:Bone morphogenetic protein receptor type-1A
Type:Enzyme
Mol. Mass.:60204.46
Organism:Homo sapiens (Human)
Description:P36894
Residue:532
BDBM148329
NameBDBM148329
Synonyms:US10017516, Compound 19 | US9682983, 19
TypeSmall organic molecule
Emp. Form.C28H29N7
Mol. Mass.463.5768
SMILESCN(C)Cc1ccc2c(ccnc2c1)-c1cnn2cc(cnc12)-c1ccc(cc1)N1CCNCC1