Reaction Details
TargetActivin receptor type-1B
LigandBDBM161920
Substrate/Competitorn/a
Meas. Tech.Enzyme Assay
IC50 8090±n/a nM
Citation Alimardanov, ACuny, GDGrewal, GSLee, AMcKew, JCMohedas, AHShen, MXu, XYu, PB BMP inhibitors and methods of use thereof US Patent US10017516 Publication Date 7/10/2018
 
Activin receptor type-1B
Name:Activin receptor type-1B
Type:PROTEIN
Mol. Mass.:56810.99
Organism:Homo sapiens (Human)
Description:ChEMBL_587064
Residue:505
BDBM161920
NameBDBM161920
Synonyms:US10017516, Compound 53 US9682983, 53
TypeSmall organic molecule
Emp. Form.C27H26N6
Mol. Mass.434.5355
SMILESC[C@H]1CNC[C@@H](C)N1c1ccc(cc1)-c1cnc2c(cnn2c1)-c1cccc2ncccc12